{"text_format":"1","workbook":"xlsx","n_sheets":9,"sheets":["配布","集計","集計２","解答","集計3","1101","1102","1103","最後"],"not_rendered":{"charts":0,"images":0,"macros":1,"external_links":0,"defined_names":1,"comments":4,"pivot_tables":0},"unopened":[],"bounds":{"document_bytes":16777216,"sheet_cells":100000,"rows_first":2000,"rows_last":500,"rows_between":2000,"halvings":0,"cell_chars":16384,"cell_head_chars":4096},"cells_cut":0,"cells_raw":0,"read":"whole","date_system":"1900"}

{"sheet":"配布","index":0,"n_rows":53,"n_cols":31,"rows_kept":53,"cut":false,"hidden":false,"merged":[[6,6,6,8],[0,0,0,3],[2,6,2,8],[3,6,3,8],[4,6,4,8],[5,6,5,8],[18,6,18,8],[7,6,7,8],[8,6,8,8],[9,6,9,8],[10,6,10,8],[11,6,11,8],[12,6,12,8],[13,6,13,8],[14,6,14,8],[15,6,15,8],[16,6,16,8],[17,6,17,8],[30,6,30,8],[19,6,19,8],[20,6,20,8],[21,6,21,8],[22,6,22,8],[23,6,23,8],[24,6,24,8],[25,6,25,8],[26,6,26,8],[27,6,27,8],[28,6,28,8],[29,6,29,8],[42,6,42,8],[31,6,31,8],[32,6,32,8],[33,6,33,8],[34,6,34,8],[35,6,35,8],[36,6,36,8],[37,6,37,8],[38,6,38,8],[39,6,39,8],[40,6,40,8],[41,6,41,8],[49,6,49,8],[50,6,50,8],[51,6,51,8],[52,6,52,8],[43,6,43,8],[44,6,44,8],[45,6,45,8],[46,6,46,8],[47,6,47,8],[48,6,48,8]]}
["学習の記録",null,null,null,null,"HRNO",1100,"氏名","情報太郎",null,"時間数",1,"出席",{"$f":"COUNT(C4:C53)","v":0},"欠席",{"$f":"L1-N1","v":1},"総文字数",{"$f":"SUM(J4:J53)","v":0},"達成数",{"$f":"COUNTIF(J4:J53,\">=30\")","v":0}]
[]
["No","日付","出欠\n(出1,遅2,早3)","欠席者No.","ノート","評価","反省・感想・備考",null,null,"文字数","A1","A2","A3","A4","A5","A6","A7","A8","A9","A10","S1","S2","S3","S4","S5","S6","S7","S8","S9","S10","T"]
[1,null,null,null,null,null,null,null,null,{"$f":"LEN(G4)","v":0},null,null,null,null,null,null,null,null,null,null,{"$f":"IF(解答!B2=\"\",\"\",IF(K4=解答!B2,1,0))","v":0},{"$f":"IF(解答!C2=\"\",\"\",IF(L4=解答!C2,1,0))","v":0},{"$f":"IF(解答!D2=\"\",\"\",IF(M4=解答!D2,1,0))","v":0},{"$f":"IF(解答!E2=\"\",\"\",IF(N4=解答!E2,1,0))","v":0},{"$f":"IF(解答!F2=\"\",\"\",IF(O4=解答!F2,1,0))","v":0},{"$f":"IF(解答!G2=\"\",\"\",IF(P4=解答!G2,1,0))","v":0},{"$f":"IF(解答!H2=\"\",\"\",IF(Q4=解答!H2,1,0))","v":0},{"$f":"IF(解答!I2=\"\",\"\",IF(R4=解答!I2,1,0))","v":0},{"$f":"IF(解答!J2=\"\",\"\",IF(S4=解答!J2,1,0))","v":0},{"$f":"IF(解答!K2=\"\",\"\",IF(T4=解答!K2,1,0))","v":0},{"$f":"SUM(U4:AD4)","v":0}]
[2,null,null,null,null,null,null,null,null,{"$f":"LEN(G5)","v":0},null,null,null,null,null,null,null,null,null,null,{"$f":"IF(解答!B3=\"\",\"\",IF(K5=解答!B3,1,0))","v":""},{"$f":"IF(解答!C3=\"\",\"\",IF(L5=解答!C3,1,0))","v":""},{"$f":"IF(解答!D3=\"\",\"\",IF(M5=解答!D3,1,0))","v":""},{"$f":"IF(解答!E3=\"\",\"\",IF(N5=解答!E3,1,0))","v":""},{"$f":"IF(解答!F3=\"\",\"\",IF(O5=解答!F3,1,0))","v":""},{"$f":"IF(解答!G3=\"\",\"\",IF(P5=解答!G3,1,0))","v":""},{"$f":"IF(解答!H3=\"\",\"\",IF(Q5=解答!H3,1,0))","v":""},{"$f":"IF(解答!I3=\"\",\"\",IF(R5=解答!I3,1,0))","v":""},{"$f":"IF(解答!J3=\"\",\"\",IF(S5=解答!J3,1,0))","v":""},{"$f":"IF(解答!K3=\"\",\"\",IF(T5=解答!K3,1,0))","v":""},{"$f":"IF(解答!B3=\"\",\"\",SUM(U5:AD5))","v":""}]
[3,null,null,null,null,null,null,null,null,0,null,null,null,null,null,null,null,null,null,null,{"$f":"IF(解答!B4=\"\",\"\",IF(K6=解答!B4,1,0))","v":""},{"$f":"IF(解答!C4=\"\",\"\",IF(L6=解答!C4,1,0))","v":""},{"$f":"IF(解答!D4=\"\",\"\",IF(M6=解答!D4,1,0))","v":""},{"$f":"IF(解答!E4=\"\",\"\",IF(N6=解答!E4,1,0))","v":""},{"$f":"IF(解答!F4=\"\",\"\",IF(O6=解答!F4,1,0))","v":""},{"$f":"IF(解答!G4=\"\",\"\",IF(P6=解答!G4,1,0))","v":""},{"$f":"IF(解答!H4=\"\",\"\",IF(Q6=解答!H4,1,0))","v":""},{"$f":"IF(解答!I4=\"\",\"\",IF(R6=解答!I4,1,0))","v":""},{"$f":"IF(解答!J4=\"\",\"\",IF(S6=解答!J4,1,0))","v":""},{"$f":"IF(解答!K4=\"\",\"\",IF(T6=解答!K4,1,0))","v":""},{"$f":"IF(解答!B4=\"\",\"\",SUM(U6:AD6))","v":""}]
{"$rows_left_out":48}
{"sheet":"集計","index":1,"n_rows":46,"n_cols":15,"rows_kept":46,"cut":false,"hidden":false,"merged":[]}
["連番","HRNO","名前","列１","列２","列３","列４","列５","列６","列７","達成","備考",null,"class",11]
[1,{"$f":"$O$1*100+A2","v":1101},{"$f":"INDIRECT($B2&\"!I1\")","v":"赤坂音羽"},{"$f":"INDIRECT($B2&\"!\"&$O$4&$O$3+3)","v":"2022-04-11"},{"$f":"INDIRECT($B2&\"!\"&$O$5&$O$3+3)","v":1},{"$f":"INDIRECT($B2&\"!\"&$O$6&$O$3+3)","v":0},{"$f":"INDIRECT($B2&\"!\"&$O$7&$O$3+3)","v":"学習の記録\n情報ノートの準備\n教科書P１６～P１７"},{"$f":"INDIRECT($B2&\"!\"&$O$8&$O$3+3)","v":2},{"$f":"INDIRECT($B2&\"!\"&$O$9&$O$3+3)","v":"今日の内容は分かりました。"},{"$f":"INDIRECT($B2&\"!\"&$O$10&$O$3+3)","v":13},{"$f":"IF(J2>=30,1,0)","v":0}]
[2,1102,{"$f":"INDIRECT($B3&\"!I1\")","v":"新居満里奈"},"2022-04-11",1,0,"学習の記録\n情報ノートの準備\n教科書P１６～P１７",2,"久しぶりにパソコンに触れたのですが、ちゃんと覚えていてよかったです。",34,{"$f":"IF(J3>=30,1,0)","v":1},null,null,"No",1]
[3,1103,"石部湖南","2022-04-11",1,0,"学習の記録\n情報ノートの準備\n教科書P１６～P１７",2,"学習の記録の仕方に早く慣れるように頑張ります。ギターのようにパソコンが使えたらいいと思っています。",49,1,null,null,"列１","B"]
[4,1104,{"$error":"#REF!"},{"$error":"#REF!"},{"$error":"#REF!"},{"$error":"#REF!"},{"$error":"#REF!"},{"$error":"#REF!"},{"$error":"#REF!"},{"$error":"#REF!"},{"$error":"#REF!"},null,null,"列２","C"]
[5,1105,{"$error":"#REF!"},{"$error":"#REF!"},{"$error":"#REF!"},{"$error":"#REF!"},{"$error":"#REF!"},{"$error":"#REF!"},{"$error":"#REF!"},{"$error":"#REF!"},{"$error":"#REF!"},null,null,"列３","D"]
{"$rows_left_out":41}
{"sheet":"集計２","index":2,"n_rows":46,"n_cols":29,"rows_kept":46,"cut":false,"hidden":false,"merged":[]}
["連番","HRNO","名前","日付","A1","A2","A3","A4","A5","A6","A7","A8","A9","A10","Q1","Q2","Q3","Q4","Q5","Q6","Q7","Q8","Q9","Q10","得点","備考",null,"class",11]
[1,{"$f":"$AC$1*100+A2","v":1101},{"$f":"INDIRECT($B2&\"!I1\")","v":"赤坂音羽"},{"$f":"INDIRECT($B2&\"!\"&$AC$4&$AC$3+3)","v":"2022-04-11"},{"$f":"INDIRECT($B2&\"!\"&$AC$5&$AC$3+3)","v":1},{"$f":"INDIRECT($B2&\"!\"&$AC$6&$AC$3+3)","v":2},{"$f":"INDIRECT($B2&\"!\"&$AC$7&$AC$3+3)","v":3},{"$f":"INDIRECT($B2&\"!\"&$AC$8&$AC$3+3)","v":4},{"$f":"INDIRECT($B2&\"!\"&$AC$9&$AC$3+3)","v":5},{"$f":"INDIRECT($B2&\"!\"&$AC$10&$AC$3+3)","v":6},{"$f":"INDIRECT($B2&\"!\"&$AC$11&$AC$3+3)","v":7},{"$f":"INDIRECT($B2&\"!\"&$AC$12&$AC$3+3)","v":8},{"$f":"INDIRECT($B2&\"!\"&$AC$13&$AC$3+3)","v":9},{"$f":"INDIRECT($B2&\"!\"&$AC$14&$AC$3+3)","v":10},{"$f":"IF(E2=VLOOKUP($AC$3,解答!$A$2:$K$51,2,0),1,0)","v":1},{"$f":"IF(F2=VLOOKUP($AC$3,解答!$A$2:$K$51,3,0),1,0)","v":1},{"$f":"IF(G2=VLOOKUP($AC$3,解答!$A$2:$K$51,4,0),1,0)","v":1},{"$f":"IF(H2=VLOOKUP($AC$3,解答!$A$2:$K$51,5,0),1,0)","v":1},{"$f":"IF(I2=VLOOKUP($AC$3,解答!$A$2:$K$51,6,0),1,0)","v":1},{"$f":"IF(J2=VLOOKUP($AC$3,解答!$A$2:$K$51,7,0),1,0)","v":1},{"$f":"IF(K2=VLOOKUP($AC$3,解答!$A$2:$K$51,8,0),1,0)","v":1},{"$f":"IF(L2=VLOOKUP($AC$3,解答!$A$2:$K$51,9,0),1,0)","v":1},{"$f":"IF(M2=VLOOKUP($AC$3,解答!$A$2:$K$51,10,0),1,0)","v":1},{"$f":"IF(N2=VLOOKUP($AC$3,解答!$A$2:$K$51,11,0),1,0)","v":1},{"$f":"SUM(O2:X2)","v":10}]
[2,1102,{"$f":"INDIRECT($B3&\"!I1\")","v":"新居満里奈"},"2022-04-11",1,2,3,4,5,{"$f":"INDIRECT($B3&\"!\"&$AC$10&$AC$3+3)","v":5},{"$f":"INDIRECT($B3&\"!\"&$AC$11&$AC$3+3)","v":4},{"$f":"INDIRECT($B3&\"!\"&$AC$12&$AC$3+3)","v":3},{"$f":"INDIRECT($B3&\"!\"&$AC$13&$AC$3+3)","v":2},{"$f":"INDIRECT($B3&\"!\"&$AC$14&$AC$3+3)","v":1},{"$f":"IF(E3=VLOOKUP($AC$3,解答!$A$2:$K$51,2,0),1,0)","v":1},{"$f":"IF(F3=VLOOKUP($AC$3,解答!$A$2:$K$51,3,0),1,0)","v":1},{"$f":"IF(G3=VLOOKUP($AC$3,解答!$A$2:$K$51,4,0),1,0)","v":1},{"$f":"IF(H3=VLOOKUP($AC$3,解答!$A$2:$K$51,5,0),1,0)","v":1},{"$f":"IF(I3=VLOOKUP($AC$3,解答!$A$2:$K$51,6,0),1,0)","v":1},{"$f":"IF(J3=VLOOKUP($AC$3,解答!$A$2:$K$51,7,0),1,0)","v":0},{"$f":"IF(K3=VLOOKUP($AC$3,解答!$A$2:$K$51,8,0),1,0)","v":0},{"$f":"IF(L3=VLOOKUP($AC$3,解答!$A$2:$K$51,9,0),1,0)","v":0},{"$f":"IF(M3=VLOOKUP($AC$3,解答!$A$2:$K$51,10,0),1,0)","v":0},{"$f":"IF(N3=VLOOKUP($AC$3,解答!$A$2:$K$51,11,0),1,0)","v":0},{"$f":"SUM(O3:X3)","v":5},null,null,"No",1]
[3,1103,"石部湖南","2022-04-11",1,2,3,6,5,4,7,8,9,10,{"$f":"IF(E4=VLOOKUP($AC$3,解答!$A$2:$K$51,2,0),1,0)","v":1},{"$f":"IF(F4=VLOOKUP($AC$3,解答!$A$2:$K$51,3,0),1,0)","v":1},{"$f":"IF(G4=VLOOKUP($AC$3,解答!$A$2:$K$51,4,0),1,0)","v":1},{"$f":"IF(H4=VLOOKUP($AC$3,解答!$A$2:$K$51,5,0),1,0)","v":0},{"$f":"IF(I4=VLOOKUP($AC$3,解答!$A$2:$K$51,6,0),1,0)","v":1},{"$f":"IF(J4=VLOOKUP($AC$3,解答!$A$2:$K$51,7,0),1,0)","v":0},{"$f":"IF(K4=VLOOKUP($AC$3,解答!$A$2:$K$51,8,0),1,0)","v":1},{"$f":"IF(L4=VLOOKUP($AC$3,解答!$A$2:$K$51,9,0),1,0)","v":1},{"$f":"IF(M4=VLOOKUP($AC$3,解答!$A$2:$K$51,10,0),1,0)","v":1},{"$f":"IF(N4=VLOOKUP($AC$3,解答!$A$2:$K$51,11,0),1,0)","v":1},8,null,null,"日付","B"]
[4,1104,{"$error":"#REF!"},{"$error":"#REF!"},{"$error":"#REF!"},{"$error":"#REF!"},{"$error":"#REF!"},{"$error":"#REF!"},{"$error":"#REF!"},{"$error":"#REF!"},{"$error":"#REF!"},{"$error":"#REF!"},{"$error":"#REF!"},{"$error":"#REF!"},{"$f":"IF(E5=VLOOKUP($AC$3,解答!$A$2:$K$51,2,0),1,0)","v":{"$error":"#REF!"}},{"$f":"IF(F5=VLOOKUP($AC$3,解答!$A$2:$K$51,3,0),1,0)","v":{"$error":"#REF!"}},{"$f":"IF(G5=VLOOKUP($AC$3,解答!$A$2:$K$51,4,0),1,0)","v":{"$error":"#REF!"}},{"$f":"IF(H5=VLOOKUP($AC$3,解答!$A$2:$K$51,5,0),1,0)","v":{"$error":"#REF!"}},{"$f":"IF(I5=VLOOKUP($AC$3,解答!$A$2:$K$51,6,0),1,0)","v":{"$error":"#REF!"}},{"$f":"IF(J5=VLOOKUP($AC$3,解答!$A$2:$K$51,7,0),1,0)","v":{"$error":"#REF!"}},{"$f":"IF(K5=VLOOKUP($AC$3,解答!$A$2:$K$51,8,0),1,0)","v":{"$error":"#REF!"}},{"$f":"IF(L5=VLOOKUP($AC$3,解答!$A$2:$K$51,9,0),1,0)","v":{"$error":"#REF!"}},{"$f":"IF(M5=VLOOKUP($AC$3,解答!$A$2:$K$51,10,0),1,0)","v":{"$error":"#REF!"}},{"$f":"IF(N5=VLOOKUP($AC$3,解答!$A$2:$K$51,11,0),1,0)","v":{"$error":"#REF!"}},{"$error":"#REF!"},null,null,"A1","K"]
[5,1105,{"$error":"#REF!"},{"$error":"#REF!"},{"$error":"#REF!"},{"$error":"#REF!"},{"$error":"#REF!"},{"$error":"#REF!"},{"$error":"#REF!"},{"$error":"#REF!"},{"$error":"#REF!"},{"$error":"#REF!"},{"$error":"#REF!"},{"$error":"#REF!"},{"$f":"IF(E6=VLOOKUP($AC$3,解答!$A$2:$K$51,2,0),1,0)","v":{"$error":"#REF!"}},{"$f":"IF(F6=VLOOKUP($AC$3,解答!$A$2:$K$51,3,0),1,0)","v":{"$error":"#REF!"}},{"$f":"IF(G6=VLOOKUP($AC$3,解答!$A$2:$K$51,4,0),1,0)","v":{"$error":"#REF!"}},{"$f":"IF(H6=VLOOKUP($AC$3,解答!$A$2:$K$51,5,0),1,0)","v":{"$error":"#REF!"}},{"$f":"IF(I6=VLOOKUP($AC$3,解答!$A$2:$K$51,6,0),1,0)","v":{"$error":"#REF!"}},{"$f":"IF(J6=VLOOKUP($AC$3,解答!$A$2:$K$51,7,0),1,0)","v":{"$error":"#REF!"}},{"$f":"IF(K6=VLOOKUP($AC$3,解答!$A$2:$K$51,8,0),1,0)","v":{"$error":"#REF!"}},{"$f":"IF(L6=VLOOKUP($AC$3,解答!$A$2:$K$51,9,0),1,0)","v":{"$error":"#REF!"}},{"$f":"IF(M6=VLOOKUP($AC$3,解答!$A$2:$K$51,10,0),1,0)","v":{"$error":"#REF!"}},{"$f":"IF(N6=VLOOKUP($AC$3,解答!$A$2:$K$51,11,0),1,0)","v":{"$error":"#REF!"}},{"$error":"#REF!"},null,null,"A2","L"]
{"$rows_left_out":41}
{"sheet":"解答","index":3,"n_rows":46,"n_cols":12,"rows_kept":46,"cut":false,"hidden":false,"merged":[]}
["回数","Q1","Q2","Q3","Q4","Q5","Q6","Q7","Q8","Q9","Q10","備考"]
[1,1,2,3,4,5,6,7,8,9,10]
[2]
[3]
[4]
[5]
{"$rows_left_out":41}
{"sheet":"集計3","index":4,"n_rows":46,"n_cols":14,"rows_kept":46,"cut":false,"hidden":false,"merged":[]}
["連番","HRNO","名前","日付","セル１","セル２","セル３","セル４","セル５","備考",null,"class",11]
[1,{"$f":"$M$1*100+A2","v":1101},{"$f":"INDIRECT($B2&\"!I1\")","v":"赤坂音羽"},{"$f":"INDIRECT($B2&\"!\"&$M$4&$M$3+3)","v":"2022-04-11"},{"$f":"INDIRECT($B2&\"!\"&$M$5&$N$5)","v":1},{"$f":"INDIRECT($B2&\"!\"&$M$6&$N$6)","v":1},{"$f":"INDIRECT($B2&\"!\"&$M$7&$N$7)","v":0},{"$f":"INDIRECT($B2&\"!\"&$M$8&$N$8)","v":13},{"$f":"INDIRECT($B2&\"!\"&$M$9&$N$9)","v":0}]
[2,1102,{"$f":"INDIRECT($B3&\"!I1\")","v":"新居満里奈"},"2022-04-11",{"$f":"INDIRECT($B3&\"!\"&$M$5&$N$5)","v":1},{"$f":"INDIRECT($B3&\"!\"&$M$6&$N$6)","v":1},{"$f":"INDIRECT($B3&\"!\"&$M$7&$N$7)","v":0},{"$f":"INDIRECT($B3&\"!\"&$M$8&$N$8)","v":34},{"$f":"INDIRECT($B3&\"!\"&$M$9&$N$9)","v":1},null,null,"No",1]
[3,1103,"石部湖南","2022-04-11",1,1,0,49,1,null,null,"日付","B"]
[4,1104,{"$error":"#REF!"},{"$error":"#REF!"},{"$error":"#REF!"},{"$error":"#REF!"},{"$error":"#REF!"},{"$error":"#REF!"},{"$error":"#REF!"},null,null,"セル１","L",1]
[5,1105,{"$error":"#REF!"},{"$error":"#REF!"},{"$error":"#REF!"},{"$error":"#REF!"},{"$error":"#REF!"},{"$error":"#REF!"},{"$error":"#REF!"},null,null,"セル２","N",1]
{"$rows_left_out":41}
{"sheet":"1101","index":5,"n_rows":53,"n_cols":31,"rows_kept":53,"cut":false,"hidden":false,"merged":[[6,6,6,8],[0,0,0,3],[2,6,2,8],[3,6,3,8],[4,6,4,8],[5,6,5,8],[18,6,18,8],[7,6,7,8],[8,6,8,8],[9,6,9,8],[10,6,10,8],[11,6,11,8],[12,6,12,8],[13,6,13,8],[14,6,14,8],[15,6,15,8],[16,6,16,8],[17,6,17,8],[30,6,30,8],[19,6,19,8],[20,6,20,8],[21,6,21,8],[22,6,22,8],[23,6,23,8],[24,6,24,8],[25,6,25,8],[26,6,26,8],[27,6,27,8],[28,6,28,8],[29,6,29,8],[42,6,42,8],[31,6,31,8],[32,6,32,8],[33,6,33,8],[34,6,34,8],[35,6,35,8],[36,6,36,8],[37,6,37,8],[38,6,38,8],[39,6,39,8],[40,6,40,8],[41,6,41,8],[49,6,49,8],[50,6,50,8],[51,6,51,8],[52,6,52,8],[43,6,43,8],[44,6,44,8],[45,6,45,8],[46,6,46,8],[47,6,47,8],[48,6,48,8]]}
["学習の記録",null,null,null,null,"HRNO",1101,"氏名","赤坂音羽",null,"時間数",1,"出席",{"$f":"COUNT(C4:C53)","v":1},"欠席",{"$f":"L1-N1","v":0},"総文字数",{"$f":"SUM(J4:J53)","v":13},"達成数",{"$f":"COUNTIF(J4:J53,\">=30\")","v":0}]
[]
["No","日付","出欠\n(出1,遅2,早3)","欠席者No.","ノート","評価","反省・感想・備考",null,null,"文字数","A1","A2","A3","A4","A5","A6","A7","A8","A9","A10","S1","S2","S3","S4","S5","S6","S7","S8","S9","S10","T"]
[1,"2022-04-11",1,null,"学習の記録\n情報ノートの準備\n教科書P１６～P１７",2,"今日の内容は分かりました。",null,null,{"$f":"LEN(G4)","v":13},1,2,3,4,5,6,7,8,9,10,{"$f":"IF(解答!B2=\"\",\"\",IF(K4=解答!B2,1,0))","v":1},{"$f":"IF(解答!C2=\"\",\"\",IF(L4=解答!C2,1,0))","v":1},{"$f":"IF(解答!D2=\"\",\"\",IF(M4=解答!D2,1,0))","v":1},{"$f":"IF(解答!E2=\"\",\"\",IF(N4=解答!E2,1,0))","v":1},{"$f":"IF(解答!F2=\"\",\"\",IF(O4=解答!F2,1,0))","v":1},{"$f":"IF(解答!G2=\"\",\"\",IF(P4=解答!G2,1,0))","v":1},{"$f":"IF(解答!H2=\"\",\"\",IF(Q4=解答!H2,1,0))","v":1},{"$f":"IF(解答!I2=\"\",\"\",IF(R4=解答!I2,1,0))","v":1},{"$f":"IF(解答!J2=\"\",\"\",IF(S4=解答!J2,1,0))","v":1},{"$f":"IF(解答!K2=\"\",\"\",IF(T4=解答!K2,1,0))","v":1},{"$f":"SUM(U4:AD4)","v":10}]
[2,null,null,null,null,null,null,null,null,{"$f":"LEN(G5)","v":0},null,null,null,null,null,null,null,null,null,null,{"$f":"IF(解答!B3=\"\",\"\",IF(K5=解答!B3,1,0))","v":""},{"$f":"IF(解答!C3=\"\",\"\",IF(L5=解答!C3,1,0))","v":""},{"$f":"IF(解答!D3=\"\",\"\",IF(M5=解答!D3,1,0))","v":""},{"$f":"IF(解答!E3=\"\",\"\",IF(N5=解答!E3,1,0))","v":""},{"$f":"IF(解答!F3=\"\",\"\",IF(O5=解答!F3,1,0))","v":""},{"$f":"IF(解答!G3=\"\",\"\",IF(P5=解答!G3,1,0))","v":""},{"$f":"IF(解答!H3=\"\",\"\",IF(Q5=解答!H3,1,0))","v":""},{"$f":"IF(解答!I3=\"\",\"\",IF(R5=解答!I3,1,0))","v":""},{"$f":"IF(解答!J3=\"\",\"\",IF(S5=解答!J3,1,0))","v":""},{"$f":"IF(解答!K3=\"\",\"\",IF(T5=解答!K3,1,0))","v":""},{"$f":"IF(解答!B3=\"\",\"\",SUM(U5:AD5))","v":""}]
[3,null,null,null,null,null,null,null,null,0,null,null,null,null,null,null,null,null,null,null,{"$f":"IF(解答!B4=\"\",\"\",IF(K6=解答!B4,1,0))","v":""},{"$f":"IF(解答!C4=\"\",\"\",IF(L6=解答!C4,1,0))","v":""},{"$f":"IF(解答!D4=\"\",\"\",IF(M6=解答!D4,1,0))","v":""},{"$f":"IF(解答!E4=\"\",\"\",IF(N6=解答!E4,1,0))","v":""},{"$f":"IF(解答!F4=\"\",\"\",IF(O6=解答!F4,1,0))","v":""},{"$f":"IF(解答!G4=\"\",\"\",IF(P6=解答!G4,1,0))","v":""},{"$f":"IF(解答!H4=\"\",\"\",IF(Q6=解答!H4,1,0))","v":""},{"$f":"IF(解答!I4=\"\",\"\",IF(R6=解答!I4,1,0))","v":""},{"$f":"IF(解答!J4=\"\",\"\",IF(S6=解答!J4,1,0))","v":""},{"$f":"IF(解答!K4=\"\",\"\",IF(T6=解答!K4,1,0))","v":""},{"$f":"IF(解答!B4=\"\",\"\",SUM(U6:AD6))","v":""}]
{"$rows_left_out":48}
{"sheet":"1102","index":6,"n_rows":53,"n_cols":31,"rows_kept":53,"cut":false,"hidden":false,"merged":[[6,6,6,8],[0,0,0,3],[2,6,2,8],[3,6,3,8],[4,6,4,8],[5,6,5,8],[18,6,18,8],[7,6,7,8],[8,6,8,8],[9,6,9,8],[10,6,10,8],[11,6,11,8],[12,6,12,8],[13,6,13,8],[14,6,14,8],[15,6,15,8],[16,6,16,8],[17,6,17,8],[30,6,30,8],[19,6,19,8],[20,6,20,8],[21,6,21,8],[22,6,22,8],[23,6,23,8],[24,6,24,8],[25,6,25,8],[26,6,26,8],[27,6,27,8],[28,6,28,8],[29,6,29,8],[42,6,42,8],[31,6,31,8],[32,6,32,8],[33,6,33,8],[34,6,34,8],[35,6,35,8],[36,6,36,8],[37,6,37,8],[38,6,38,8],[39,6,39,8],[40,6,40,8],[41,6,41,8],[49,6,49,8],[50,6,50,8],[51,6,51,8],[52,6,52,8],[43,6,43,8],[44,6,44,8],[45,6,45,8],[46,6,46,8],[47,6,47,8],[48,6,48,8]]}
["学習の記録",null,null,null,null,"HRNO",1102,"氏名","新居満里奈",null,"時間数",1,"出席",{"$f":"COUNT(C4:C53)","v":1},"欠席",{"$f":"L1-N1","v":0},"総文字数",{"$f":"SUM(J4:J53)","v":34},"達成数",{"$f":"COUNTIF(J4:J53,\">=30\")","v":1}]
[]
["No","日付","出欠\n(出1,遅2,早3)","欠席者No.","ノート","評価","反省・感想・備考",null,null,"文字数","A1","A2","A3","A4","A5","A6","A7","A8","A9","A10","S1","S2","S3","S4","S5","S6","S7","S8","S9","S10","T"]
[1,"2022-04-11",1,null,"学習の記録\n情報ノートの準備\n教科書P１６～P１７",2,"久しぶりにパソコンに触れたのですが、ちゃんと覚えていてよかったです。",null,null,{"$f":"LEN(G4)","v":34},1,2,3,4,5,5,4,3,2,1,{"$f":"IF(解答!B2=\"\",\"\",IF(K4=解答!B2,1,0))","v":1},{"$f":"IF(解答!C2=\"\",\"\",IF(L4=解答!C2,1,0))","v":1},{"$f":"IF(解答!D2=\"\",\"\",IF(M4=解答!D2,1,0))","v":1},{"$f":"IF(解答!E2=\"\",\"\",IF(N4=解答!E2,1,0))","v":1},{"$f":"IF(解答!F2=\"\",\"\",IF(O4=解答!F2,1,0))","v":1},{"$f":"IF(解答!G2=\"\",\"\",IF(P4=解答!G2,1,0))","v":0},{"$f":"IF(解答!H2=\"\",\"\",IF(Q4=解答!H2,1,0))","v":0},{"$f":"IF(解答!I2=\"\",\"\",IF(R4=解答!I2,1,0))","v":0},{"$f":"IF(解答!J2=\"\",\"\",IF(S4=解答!J2,1,0))","v":0},{"$f":"IF(解答!K2=\"\",\"\",IF(T4=解答!K2,1,0))","v":0},{"$f":"SUM(U4:AD4)","v":5}]
[2,null,null,null,null,null,null,null,null,{"$f":"LEN(G5)","v":0},null,null,null,null,null,null,null,null,null,null,{"$f":"IF(解答!B3=\"\",\"\",IF(K5=解答!B3,1,0))","v":""},{"$f":"IF(解答!C3=\"\",\"\",IF(L5=解答!C3,1,0))","v":""},{"$f":"IF(解答!D3=\"\",\"\",IF(M5=解答!D3,1,0))","v":""},{"$f":"IF(解答!E3=\"\",\"\",IF(N5=解答!E3,1,0))","v":""},{"$f":"IF(解答!F3=\"\",\"\",IF(O5=解答!F3,1,0))","v":""},{"$f":"IF(解答!G3=\"\",\"\",IF(P5=解答!G3,1,0))","v":""},{"$f":"IF(解答!H3=\"\",\"\",IF(Q5=解答!H3,1,0))","v":""},{"$f":"IF(解答!I3=\"\",\"\",IF(R5=解答!I3,1,0))","v":""},{"$f":"IF(解答!J3=\"\",\"\",IF(S5=解答!J3,1,0))","v":""},{"$f":"IF(解答!K3=\"\",\"\",IF(T5=解答!K3,1,0))","v":""},{"$f":"IF(解答!B3=\"\",\"\",SUM(U5:AD5))","v":""}]
[3,null,null,null,null,null,null,null,null,0,null,null,null,null,null,null,null,null,null,null,{"$f":"IF(解答!B4=\"\",\"\",IF(K6=解答!B4,1,0))","v":""},{"$f":"IF(解答!C4=\"\",\"\",IF(L6=解答!C4,1,0))","v":""},{"$f":"IF(解答!D4=\"\",\"\",IF(M6=解答!D4,1,0))","v":""},{"$f":"IF(解答!E4=\"\",\"\",IF(N6=解答!E4,1,0))","v":""},{"$f":"IF(解答!F4=\"\",\"\",IF(O6=解答!F4,1,0))","v":""},{"$f":"IF(解答!G4=\"\",\"\",IF(P6=解答!G4,1,0))","v":""},{"$f":"IF(解答!H4=\"\",\"\",IF(Q6=解答!H4,1,0))","v":""},{"$f":"IF(解答!I4=\"\",\"\",IF(R6=解答!I4,1,0))","v":""},{"$f":"IF(解答!J4=\"\",\"\",IF(S6=解答!J4,1,0))","v":""},{"$f":"IF(解答!K4=\"\",\"\",IF(T6=解答!K4,1,0))","v":""},{"$f":"IF(解答!B4=\"\",\"\",SUM(U6:AD6))","v":""}]
{"$rows_left_out":48}
{"sheet":"1103","index":7,"n_rows":53,"n_cols":31,"rows_kept":53,"cut":false,"hidden":false,"merged":[[6,6,6,8],[0,0,0,3],[2,6,2,8],[3,6,3,8],[4,6,4,8],[5,6,5,8],[18,6,18,8],[7,6,7,8],[8,6,8,8],[9,6,9,8],[10,6,10,8],[11,6,11,8],[12,6,12,8],[13,6,13,8],[14,6,14,8],[15,6,15,8],[16,6,16,8],[17,6,17,8],[30,6,30,8],[19,6,19,8],[20,6,20,8],[21,6,21,8],[22,6,22,8],[23,6,23,8],[24,6,24,8],[25,6,25,8],[26,6,26,8],[27,6,27,8],[28,6,28,8],[29,6,29,8],[42,6,42,8],[31,6,31,8],[32,6,32,8],[33,6,33,8],[34,6,34,8],[35,6,35,8],[36,6,36,8],[37,6,37,8],[38,6,38,8],[39,6,39,8],[40,6,40,8],[41,6,41,8],[49,6,49,8],[50,6,50,8],[51,6,51,8],[52,6,52,8],[43,6,43,8],[44,6,44,8],[45,6,45,8],[46,6,46,8],[47,6,47,8],[48,6,48,8]]}
["学習の記録",null,null,null,null,"HRNO",1103,"氏名","石部湖南",null,"時間数",1,"出席",{"$f":"COUNT(C4:C53)","v":1},"欠席",{"$f":"L1-N1","v":0},"総文字数",{"$f":"SUM(J4:J53)","v":49},"達成数",{"$f":"COUNTIF(J4:J53,\">=30\")","v":1}]
[]
["No","日付","出欠\n(出1,遅2,早3)","欠席者No.","ノート","評価","反省・感想・備考",null,null,"文字数","A1","A2","A3","A4","A5","A6","A7","A8","A9","A10","S1","S2","S3","S4","S5","S6","S7","S8","S9","S10","T"]
[1,"2022-04-11",1,null,"学習の記録\n情報ノートの準備\n教科書P１６～P１７",2,"学習の記録の仕方に早く慣れるように頑張ります。ギターのようにパソコンが使えたらいいと思っています。",null,null,{"$f":"LEN(G4)","v":49},1,2,3,6,5,4,7,8,9,10,{"$f":"IF(解答!B2=\"\",\"\",IF(K4=解答!B2,1,0))","v":1},{"$f":"IF(解答!C2=\"\",\"\",IF(L4=解答!C2,1,0))","v":1},{"$f":"IF(解答!D2=\"\",\"\",IF(M4=解答!D2,1,0))","v":1},{"$f":"IF(解答!E2=\"\",\"\",IF(N4=解答!E2,1,0))","v":0},{"$f":"IF(解答!F2=\"\",\"\",IF(O4=解答!F2,1,0))","v":1},{"$f":"IF(解答!G2=\"\",\"\",IF(P4=解答!G2,1,0))","v":0},{"$f":"IF(解答!H2=\"\",\"\",IF(Q4=解答!H2,1,0))","v":1},{"$f":"IF(解答!I2=\"\",\"\",IF(R4=解答!I2,1,0))","v":1},{"$f":"IF(解答!J2=\"\",\"\",IF(S4=解答!J2,1,0))","v":1},{"$f":"IF(解答!K2=\"\",\"\",IF(T4=解答!K2,1,0))","v":1},{"$f":"SUM(U4:AD4)","v":8}]
[2,null,null,null,null,null,null,null,null,{"$f":"LEN(G5)","v":0},null,null,null,null,null,null,null,null,null,null,{"$f":"IF(解答!B3=\"\",\"\",IF(K5=解答!B3,1,0))","v":""},{"$f":"IF(解答!C3=\"\",\"\",IF(L5=解答!C3,1,0))","v":""},{"$f":"IF(解答!D3=\"\",\"\",IF(M5=解答!D3,1,0))","v":""},{"$f":"IF(解答!E3=\"\",\"\",IF(N5=解答!E3,1,0))","v":""},{"$f":"IF(解答!F3=\"\",\"\",IF(O5=解答!F3,1,0))","v":""},{"$f":"IF(解答!G3=\"\",\"\",IF(P5=解答!G3,1,0))","v":""},{"$f":"IF(解答!H3=\"\",\"\",IF(Q5=解答!H3,1,0))","v":""},{"$f":"IF(解答!I3=\"\",\"\",IF(R5=解答!I3,1,0))","v":""},{"$f":"IF(解答!J3=\"\",\"\",IF(S5=解答!J3,1,0))","v":""},{"$f":"IF(解答!K3=\"\",\"\",IF(T5=解答!K3,1,0))","v":""},{"$f":"IF(解答!B3=\"\",\"\",SUM(U5:AD5))","v":""}]
[3,null,null,null,null,null,null,null,null,0,null,null,null,null,null,null,null,null,null,null,{"$f":"IF(解答!B4=\"\",\"\",IF(K6=解答!B4,1,0))","v":""},{"$f":"IF(解答!C4=\"\",\"\",IF(L6=解答!C4,1,0))","v":""},{"$f":"IF(解答!D4=\"\",\"\",IF(M6=解答!D4,1,0))","v":""},{"$f":"IF(解答!E4=\"\",\"\",IF(N6=解答!E4,1,0))","v":""},{"$f":"IF(解答!F4=\"\",\"\",IF(O6=解答!F4,1,0))","v":""},{"$f":"IF(解答!G4=\"\",\"\",IF(P6=解答!G4,1,0))","v":""},{"$f":"IF(解答!H4=\"\",\"\",IF(Q6=解答!H4,1,0))","v":""},{"$f":"IF(解答!I4=\"\",\"\",IF(R6=解答!I4,1,0))","v":""},{"$f":"IF(解答!J4=\"\",\"\",IF(S6=解答!J4,1,0))","v":""},{"$f":"IF(解答!K4=\"\",\"\",IF(T6=解答!K4,1,0))","v":""},{"$f":"IF(解答!B4=\"\",\"\",SUM(U6:AD6))","v":""}]
{"$rows_left_out":48}
{"sheet":"最後","index":8,"n_rows":0,"n_cols":0,"rows_kept":0,"cut":false,"hidden":false,"merged":[]}